�s���{���R�[�h���͎s�撬���R�[�h,NO,�s���{����,�s�撬����,�c�Ə�����,�c�Ə�����_�J�i,�c�Ƃ̎��,�Ƒ�,�c�Ə����ݒn,�c�Ə�����,�ܓx,�o�x,�c�Ə��d�b�ԍ�,�@�l��,�@�l�ԍ�,���ԍ�,���񋖉N����,���N����,���J�n��,��������,�p�ƔN����,�\���敪,������,���l
282031,1,���Ɍ�,���Ύs,�l�G�̗�,,���H�X�c��,,���Ɍ����Ύs��v�ے����A�Q�O�W,,,,(078)936-4658,���c ���q,,���ې��w�ߑ�1216��,,,2022-12-01,2029-02-28,,,,
282031,2,���Ɍ�,���Ύs,�s���A�[�Y,,���H�X�c��,,���Ɍ����Ύs���Z���т��u�S�|�U�|�R �T�����[���h�r���Q�O�P,,,,,�΋� ��,,���ې��w�ߑ�1242��,,,2022-12-01,2029-02-28,,,,
282031,3,���Ɍ�,���Ύs,�����L,,���H�X�c��,,���Ɍ����Ύs�����Γ쒬�Q�|�P�R�|�S ��R�_�h�r���P�K,,,,(078)585-8877,��c ���L,,���ې��w�ߑ�1249��,,,2022-12-01,2029-02-28,,,,
282031,4,���Ɍ�,���Ύs,�X�i�b�N�@�q�����i�炢�j,,���H�X�c��,,���Ɍ����Ύs��X��R�|�P�T�|�P�Q�@�����r���n�K,,,,(078)927-5514,�吼 �f�q,,���ې��w�ߑ�1250��,,,2022-12-01,2029-02-28,,,,
282031,5,���Ɍ�,���Ύs,���΃X�C�[�c �A�C�X���ł�/�Ă����X�C�[�c �������� �݂���/ �m�`�o �R���T���e�B���O,,���H�X�c��,,���Ɍ����Ύs�񌩒����񌩂R�V�P�|�S �P�O�Q,,,,,���� ���u,,���ې��w�ߑ�1251��,,,2022-12-01,2029-02-28,,,,
282031,6,���Ɍ�,���Ύs,�C�I���y�R�X�i�z�b�g�f���J�j,,���H�X�c��,,���Ɍ����Ύs���Z�����������X�Q�Q�O�W�|�P,,,,(078)942-0811,�C�I�����e�[���������,,���ې��w�ߑ�1256��,,,2022-12-07,2030-02-28,,,,
282031,7,���Ɍ�,���Ύs,�X�i�b�N�@�|�����X,,���H�X�c��,,���Ɍ����Ύs�������Q�|�Q�|�X �r�W���[�E�h�D�E�Z�U�[���V�`,,,,,�R�c ��Y,,���ې��w�ߑ�1254��,,,2022-12-08,2029-02-28,,,,
282031,8,���Ɍ�,���Ύs,�s������������,,���H�X�c��,,���Ɍ����Ύs�������Q�|�Q�|�X �r�W���[�E�h�D�E�Z�U�[���Q�a�b�c,,,,(078)945-6666,������Ѓ��C�E�G�X�E�G�X,,���ې��w�ߑ�1255��,,,2022-12-08,2029-02-28,,,,
282031,9,���Ɍ�,���Ύs,�q�`�l�d�m�@�s�n�l�n,,���H�X�c��,,���Ɍ����Ύs�喾�Β��P�|�P�P�|�P,,,,,���� �q��,,���ې��w�ߑ�1257��,,,2022-12-09,2029-02-28,,,,
282031,10,���Ɍ�,���Ύs,�l�l�`�L��,,���H�X�c��,,���Ɍ����Ύs�����m���U�|�P �A�X�s�A���Ζk�R�e,,,,(078)962-4801,������ЃN���A�X�J�C,,���ې��w�ߑ�1259��,,,2022-12-13,2029-02-28,,,,
282031,11,���Ɍ�,���Ύs,����,,���H�X�c��,,���Ɍ����Ύs�����Γ쒬�Q�|�P�W�|�P�R,,,,(078)965-6517,�I�[���P�C�������,,���ې��w�ߑ�1263��,,,2022-12-16,2029-02-28,,,,
282031,12,���Ɍ�,���Ύs,�J�t�F�@�J���[�m,,���H�X�c��,,���Ɍ����Ύs���]�P�R�P�T ��Ö@�l���c�@������@���΂�����̃z�X�s�^�����قP�K,,,,,������Ѓ~�}�c����,,���ې��w�ߑ�1264��,,,2022-12-20,2030-02-28,,,,
282031,13,���Ɍ�,���Ύs,���΂̂߂���,,��������������,,���Ɍ����Ύs�����Γ쒬�Q�|�P�W�|�P�R,,,,(078)922-8888,�I�[���P�C�������,,���ې��w�ߑ�1265��,,,2022-12-20,2029-02-28,,,,
282031,14,���Ɍ�,���Ύs,�e�q�`�s,,���H�X�c��,,���Ɍ����Ύs�������Q�|�S�|�P�X �����r���R�e,,,,,���� �j�Y,,���ې��w�ߑ�1266��,,,2022-12-20,2029-02-28,,,,
282031,15,���Ɍ�,���Ύs,�I�X�e���A�@�v���t�[��,,���H�X�c��,,���Ɍ����Ύs�����Ζk���R�|�S�|�R �[�t�B�[�������΂P�O�U,,,,(078)585-8581,������Ѓv���t�[��,,���ې��w�ߑ�1267��,,,2022-12-22,2029-02-28,,,,
282031,16,���Ɍ�,���Ύs,�I�X�e���A�@�v���t�[��,,�َq������,,���Ɍ����Ύs�����Ζk���R�|�S�|�R �[�t�B�[�������΂P�O�U,,,,(078)585-8581,������Ѓv���t�[��,,���ې��w�ߑ�1268��,,,2022-12-22,2029-02-28,,,,
282031,17,���Ɍ�,���Ύs,���؂��ΐ_��,,���H�X�c��,,���Ɍ����Ύs�k�����u�Q�|�X�|�P�T �^�P�����r���R�O�P,,,,(078)600-9658,���{ �@�i,,���ې��w�ߑ�1269��,,,2022-12-22,2029-02-28,,,,
282031,18,���Ɍ�,���Ύs,�j�������@�r��������,,���H�X�c��,,���Ɍ����Ύs�{���Q�|�Q�|�P�O �N���u���]�����Ζ{���S�e,,,,,���c ����,,���ې��w�ߑ�1270��,,,2022-12-26,2029-02-28,,,,
282031,19,���Ɍ�,���Ύs,���ꐰ��,,���H�X�c��,,���Ɍ����Ύs��v�ے��]�䓇�P�O�R�R�|�S,,,,,���� �F��,,���ې��w�ߑ�1271��,,,2022-12-27,2029-02-28,,,,
282031,20,���Ɍ�,���Ύs,���ꐰ��,,�َq������,,���Ɍ����Ύs��v�ے��]�䓇�P�O�R�R�|�S,,,,,���� �F��,,���ې��w�ߑ�1272��,,,2022-12-27,2029-02-28,,,,
282031,21,���Ɍ�,���Ύs,�������@������,,���H�X�c��,,���Ɍ����Ύs�{���P�|�V�|�T,,,,(078)915-7315,��R �O�N,,���ې��w�ߑ�1273��,,,2022-12-27,2029-02-28,,,,
