�s���{���R�[�h���͎s�撬���R�[�h,NO,�s���{����,�s�撬����,�c�Ə�����,�c�Ə�����_�J�i,�c�Ƃ̎��,�Ƒ�,�c�Ə����ݒn,�c�Ə�����,�ܓx,�o�x,�c�Ə��d�b�ԍ�,�@�l��,�@�l�ԍ�,���ԍ�,���񋖉N����,���N����,���J�n��,��������,�p�ƔN����,�\���敪,������,���l
282031,1,���Ɍ�,���Ύs,������������������,,�َq������,,���Ɍ����Ύs�����Ζk���Q�|�Q�|�Q�P,,,,,�X�� �D��,,���ې��w�ߑ�1226��,,,2022-11-02,2028-11-30,,,,
282031,2,���Ɍ�,���Ύs,�J�t�F�@�T��������,,���H�X�c��,,���Ɍ����Ύs�񌩒����񌩂V�R�W�|�Q,,,,,���� ���q,,���ې��w�ߑ�1227��,,,2022-11-04,2028-11-30,,,,
282031,3,���Ɍ�,���Ύs,�Z�u���|�C���u���@���ΎR�����X,,���H�X�c��,,���Ɍ����Ύs�R�����V�|�P�O,,,,(078)913-6588,������Ђe�����������D�l,,���ې��w�ߑ�1229��,,,2022-11-08,2028-11-30,,,,
282031,4,���Ɍ�,���Ύs,�ē��@�V�}��,,�H���̔���,,���Ɍ����Ύs��v�ے������Q�R�R�|�S,,,,(078)947-6976,�_�c ���T,,���ې��w�ߑ�1231��,,,2022-11-08,2028-11-30,,,,
282031,5,���Ɍ�,���Ύs,�k���@�������@������,,���H�X�c��,,���Ɍ����Ύs���̓��Q�|�W�|�T �T�����C�t�����΂P�O�T,,,,(078)940-6114,���� ����,,���ې��w�ߑ�1233��,,,2022-11-11,2028-11-30,,,,
282031,6,���Ɍ�,���Ύs,���������@���@��������,,���H�X�c��,,���Ɍ����Ύs�������Q�|�S�|�Q�R �T�~�b�g�V�e�B�@�Q�e,,,,,��� �s,,���ې��w�ߑ�1234��,,,2022-11-18,2028-11-30,,,,
282031,7,���Ɍ�,���Ύs,�����ƍ�@������������,,���H�X�c��,,���Ɍ����Ύs�b�������S�|�P�S ���΃X���[�i�C���r���T�O�Q,,,,(078)915-2699,�]�� �R�M,,���ې��w�ߑ�1235��,,,2022-11-18,2028-11-30,,,,
282031,8,���Ɍ�,���Ύs,�i�}�X�e�@�}�n���@����,,���H�X�c��,,���Ɍ����Ύs�喾�Β��Q�|�S�|�P�U�@�P�e,,,,,�r�t�a�d�c�h �m�d�s�q�`�k�`�k,,���ې��w�ߑ�1236��,,,2022-11-18,2028-11-30,,,,
282031,9,���Ɍ�,���Ύs,�T���V�����g�R��,,���H�X�c��,,���Ɍ����Ύs�����U�|�Q�W �Z�u���N���[���r���P�O�R,,,,,��{ �O�l�Y,,���ې��w�ߑ�1237��,,,2022-11-18,2028-11-30,,,,
282031,10,���Ɍ�,���Ύs,�x�[�J���[�b�`�e�d�@������������,,���H�X�c��,,���Ɍ����Ύs�{���P�|�S�|�P�U,,,,,������Е����X�e�[�V���������̘a,,���ې��w�ߑ�1238��,,,2022-11-18,2028-11-30,,,,
282031,11,���Ɍ�,���Ύs,�y���@�Ђ�,,���H�X�c��,,���Ɍ����Ύs��v�ے��w�O�P�|�T�|�X �p���r���P�O�P,,,,,�A�� ����,,���ې��w�ߑ�1240��,,,2022-11-24,2028-11-30,,,,
282031,12,���Ɍ�,���Ύs,�s�����������������@�����@������������,,���H�X�c��,,���Ɍ����Ύs��v�ے��]�䓇�Q�W�P�|�V,,,,,��{ ����,,���ې��w�ߑ�1241��,,,2022-11-25,2028-11-30,,,,
282031,13,���Ɍ�,���Ύs,�N�b�N�f����V��v�ۓX,,���H�X�c��,,���Ɍ����Ύs��v�ے����̂��ʂP�|�R�|�P �r�G����v�ۂQ�K,,,,(078)937-0340,������Ђ����ȃ_�C�j���O,,���ې��w�ߑ�1245��,,,2022-11-25,2028-11-30,,,,
282031,14,���Ɍ�,���Ύs,�N�b�N�f����V�����ΓX,,���H�X�c��,,���Ɍ����Ύs���v�ۂQ�|�V�|�Q�O �X�e�[�V�����v���U�����΂P�e,,,,(078)927-0045,������Ђ����ȃ_�C�j���O,,���ې��w�ߑ�1246��,,,2022-11-28,2028-11-30,,,,
282031,15,���Ɍ�,���Ύs,�a�`�q�@�`�q�b�`�c�h�`,,���H�X�c��,,���Ɍ����Ύs�����R�|�W�I�[�i�[�Y�r���P�`,,,,,�V�� �T��,,���ې��w�ߑ�1247��,,,2022-11-29,2028-11-30,,,,
282031,16,���Ɍ�,���Ύs,����������,,���H�X�c��,,���Ɍ����Ύs�����T�|�P�O ���F���r�������P�O�P,,,,(078)914-6090,���R ��,,���ې��w�ߑ�1248��,,,2022-11-30,2028-11-30,,,,
,,,,,,,,,,,,,,,,,,,,,,,
,,,,,,,,,,,,,,,,,,,,,,,
,,,,,,,,,,,,,,,,,,,,,,,
,,,,,,,,,,,,,,,,,,,,,,,
